{"text_format":"1","workbook":"xlsx","n_sheets":10,"sheets":["Planilha Base","Tabela de Combate","Manobras","Cartas de Combate","Manobras Final","Ficha","Ficha Final","Estilos","BASE","BASE MANOBRAS"],"not_rendered":{"charts":0,"images":0,"macros":1,"external_links":1,"defined_names":7,"comments":0,"pivot_tables":0},"unopened":[],"bounds":{"document_bytes":16777216,"sheet_cells":100000,"rows_first":2000,"rows_last":500,"rows_between":2000,"halvings":0,"cell_chars":16384,"cell_head_chars":4096},"cells_cut":0,"cells_raw":0,"read":"whole","date_system":"1900"}

{"sheet":"Planilha Base","index":0,"n_rows":46,"n_cols":1,"rows_kept":46,"cut":false,"hidden":true,"merged":[]}
[]
[]
[]
[]
[]
[]
{"$rows_left_out":41}
{"sheet":"Tabela de Combate","index":1,"n_rows":43,"n_cols":12,"rows_kept":43,"cut":false,"hidden":true,"merged":[[5,0,5,1],[0,0,0,1],[1,0,1,1],[2,0,2,1],[3,0,3,1],[4,0,4,1],[17,0,17,1],[6,0,6,1],[7,0,7,1],[8,0,8,1],[9,0,9,1],[10,0,10,1],[11,0,11,1],[12,0,12,1],[13,0,13,1],[14,0,14,1],[15,0,15,1],[16,0,16,1],[29,0,29,1],[18,0,18,1],[19,0,19,1],[20,0,20,1],[21,0,21,1],[22,0,22,1],[23,0,23,1],[24,0,24,1],[25,0,25,1],[26,0,26,1],[27,0,27,1],[28,0,28,1],[42,0,42,4],[42,5,42,9],[30,0,30,1],[31,0,31,1],[32,0,32,1],[33,0,33,1],[34,0,34,1],[35,0,35,1]]}
["Manobras",null,"Vel","Dano","Dano 2","Dano 3","Dano 4","Mov","Chi","Vontade"]
[{"$f":"Ficha!J7","v":"Jab"},null,{"$f":"Ficha!L7","v":4},{"$f":"Ficha!M7","v":3},{"$f":"Ficha!N7","v":0},{"$f":"Ficha!O7","v":0},{"$f":"Ficha!P7","v":0},{"$f":"Ficha!Q7","v":4},{"$f":"Ficha!R7","v":0},{"$f":"Ficha!S7","v":0}]
[{"$f":"Ficha!J8","v":"Strong"},null,{"$f":"Ficha!L8","v":2},{"$f":"Ficha!M8","v":5},{"$f":"Ficha!N8","v":0},{"$f":"Ficha!O8","v":0},{"$f":"Ficha!P8","v":0},{"$f":"Ficha!Q8","v":4},{"$f":"Ficha!R8","v":0},{"$f":"Ficha!S8","v":0}]
[{"$f":"Ficha!J9","v":"Fierce"},null,{"$f":"Ficha!L9","v":1},{"$f":"Ficha!M9","v":7},{"$f":"Ficha!N9","v":0},{"$f":"Ficha!O9","v":0},{"$f":"Ficha!P9","v":0},{"$f":"Ficha!Q9","v":3},{"$f":"Ficha!R9","v":0},{"$f":"Ficha!S9","v":0}]
[{"$f":"Ficha!J10","v":"Short"},null,{"$f":"Ficha!L10","v":3},{"$f":"Ficha!M10","v":8},{"$f":"Ficha!N10","v":0},{"$f":"Ficha!O10","v":0},{"$f":"Ficha!P10","v":0},{"$f":"Ficha!Q10","v":4},{"$f":"Ficha!R10","v":0},{"$f":"Ficha!S10","v":0}]
[{"$f":"Ficha!J11","v":"Forward"},null,{"$f":"Ficha!L11","v":2},{"$f":"Ficha!M11","v":10},{"$f":"Ficha!N11","v":0},{"$f":"Ficha!O11","v":0},{"$f":"Ficha!P11","v":0},{"$f":"Ficha!Q11","v":3},{"$f":"Ficha!R11","v":0},{"$f":"Ficha!S11","v":0}]
{"$rows_left_out":38}
{"sheet":"Manobras","index":2,"n_rows":445,"n_cols":62,"rows_kept":445,"cut":false,"hidden":true,"merged":[]}
["Nome","Tecnica","Mod Vel","Mod Dano","Dano 2","Dano 3","Dano 4","Mod Mov","Chi","FdV","Sistema Resumido",null,null,null,null,null,null,null,null,null,null,null,null,null,null,null,null,null,null,null,null,null,null,null,null,null,null,null,null,null,null,null,null,null,null,null,null,null,null,null,null,null,null,null,null,null,null,null,null,null,null,"Manobras"]
[]
["MANOBRAS OFICIAIS"]
[]
["Acid Breath","Foco",{"$f":"-2+SUM(Ficha!Q2)","v":1},{"$f":"3+SUM(Ficha!S2,Ficha!K4)","v":5},{"$f":"0+SUM(Ficha!S2,Ficha!K4)","v":2},{"$f":"-3+SUM(Ficha!S2,Ficha!K4)","v":-1},null,{"$f":"-1+SUM(Ficha!Q3)","v":3},1,null,"Alcance = Vigor; alvo precisa estar na linha de visão; causa +3 DAN imediatamente; no fim do próximo, caso o ácido não seja removido, role agora com +0, e no fim de 2 turnos de espera com -3",null,null,null,null,null,null,null,null,null,null,null,null,null,null,null,null,null,null,null,null,null,null,null,null,null,null,null,null,null,null,null,null,null,null,null,null,null,null,null,null,null,null,null,null,null,null,null,null,null,null,"Acid Breath"]
["Air Blast","Foco",{"$f":"-1+SUM(Ficha!Q2)","v":2},{"$f":"3+SUM(Ficha!S2,Ficha!K4)","v":5},null,null,null,"Nenhum",1,null,"Alcance = Inteligência + Antecedente Elemental; alvo precisa estar na linha de visão; alvo precisa passar em um teste de Percepção + Luta às Cegas para perceber e interromper este ataque",null,null,null,null,null,null,null,null,null,null,null,null,null,null,null,null,null,null,null,null,null,null,null,null,null,null,null,null,null,null,null,null,null,null,null,null,null,null,null,null,null,null,null,null,null,null,null,null,null,null,"Air Blast"]
{"$rows_left_out":440}
{"sheet":"Cartas de Combate","index":3,"n_rows":220,"n_cols":9,"rows_kept":220,"cut":false,"hidden":true,"merged":[[2,0,2,2],[2,3,2,5],[2,6,2,8],[3,0,3,2],[3,3,3,5],[3,6,3,8],[0,0,0,2],[0,3,0,5],[0,6,0,8],[1,1,1,2],[1,4,1,5],[1,7,1,8],[7,0,14,2],[7,3,14,5],[7,6,14,8],[15,0,15,2],[15,3,15,5],[15,6,15,8],[4,1,4,2],[4,4,4,5],[4,7,4,8],[5,0,6,0],[5,3,6,3],[5,6,6,6],[18,0,18,2],[18,3,18,5],[18,6,18,8],[19,1,19,2],[19,4,19,5],[19,7,19,8],[16,1,16,2],[16,4,16,5],[16,7,16,8],[17,0,17,2],[17,3,17,5],[17,6,17,8],[30,0,30,2],[30,3,30,5],[30,6,30,8],[31,1,31,2],[31,4,31,5],[31,7,31,8],[20,0,21,0],[20,3,21,3],[20,6,21,6],[22,0,29,2],[22,3,29,5],[22,6,29,8],[34,1,34,2],[34,4,34,5],[34,7,34,8],[35,0,36,0],[35,3,36,3],[35,6,36,6],[32,0,32,2],[32,3,32,5],[32,6,32,8],[33,0,33,2],[33,3,33,5],[33,6,33,8],[48,1,48,2],[48,4,48,5],[48,7,48,8],[51,1,51,2],[51,4,51,5],[51,7,51,8],[37,0,44,2],[37,3,44,5],[37,6,44,8],[47,0,47,2],[47,3,47,5],[47,6,47,8],[62,0,62,2],[62,3,62,5],[62,6,62,8],[63,1,63,2],[63,4,63,5],[63,7,63,8],[52,0,53,0],[52,3,53,3],[52,6,53,6],[54,0,61,2],[54,3,61,5],[54,6,61,8],[69,0,76,2],[69,3,76,5],[69,6,76,8],[77,0,77,2],[77,3,77,5],[77,6,77,8],[66,1,66,2],[66,4,66,5],[66,7,66,8],[67,0,68,0],[67,3,68,3],[67,6,68,6],[82,0,83,0],[82,3,83,3],[82,6,83,6],[84,0,91,2],[84,3,91,5],[84,6,91,8],[78,1,78,2],[78,4,78,5],[78,7,78,8],[81,1,81,2],[81,4,81,5],[81,7,81,8],[96,1,96,2],[96,4,96,5],[96,7,96,8],[97,0,98,0],[97,3,98,3],[97,6,98,6],[92,0,92,2],[92,3,92,5],[92,6,92,8],[93,1,93,2],[93,4,93,5],[93,7,93,8],[108,1,108,2],[108,4,108,5],[108,7,108,8],[111,1,111,2],[111,4,111,5],[111,7,111,8],[99,0,106,2],[99,3,106,5],[99,6,106,8],[107,0,107,2],[107,3,107,5],[107,6,107,8],[122,0,122,2],[122,3,122,5],[122,6,122,8],[123,1,123,2],[123,4,123,5],[123,7,123,8],[112,0,113,0],[112,3,113,3],[112,6,113,6],[114,0,121,2],[114,3,121,5],[114,6,121,8],[129,0,136,2],[129,3,136,5],[129,6,136,8],[139,0,139,2],[139,3,139,5],[139,6,139,8],[126,1,126,2],[126,4,126,5],[126,7,126,8],[127,0,128,0],[127,3,128,3],[127,6,128,6],[144,0,145,0],[144,3,145,3],[144,6,145,6],[146,0,153,2],[146,3,153,5],[146,6,153,8],[140,1,140,2],[140,4,140,5],[140,7,140,8],[143,1,143,2],[143,4,143,5],[143,7,143,8],[158,1,158,2],[158,4,158,5],[158,7,158,8],[159,0,160,0],[159,3,160,3],[159,6,160,6],[154,0,154,2],[154,3,154,5],[154,6,154,8],[155,1,155,2],[155,4,155,5],[155,7,155,8],[170,1,170,2],[170,4,170,5],[170,7,170,8],[173,1,173,2],[173,4,173,5],[173,7,173,8],[161,0,168,2],[161,3,168,5],[161,6,168,8],[169,0,169,2],[169,3,169,5],[169,6,169,8],[187,0,187,8],[188,0,188,2],[188,3,188,5],[188,6,188,8],[189,1,189,2],[189,4,189,5],[189,7,189,8],[174,0,175,0],[174,3,175,3],[174,6,175,6],[176,0,183,2],[176,3,183,5],[176,6,183,8],[192,1,192,2],[192,4,192,5],[192,7,192,8],[193,0,194,0],[193,3,194,3],[193,6,194,6],[190,0,190,2],[190,3,190,5],[190,6,190,8],[191,0,191,2],[191,3,191,5],[191,6,191,8],[219,0,219,8],[206,0,206,2],[206,3,206,5],[207,1,207,2],[207,4,207,5],[208,0,209,0],[208,3,209,3],[195,0,202,2],[195,3,202,5],[195,6,202,8],[203,0,203,2],[203,3,203,5],[203,6,217,8],[204,1,204,2],[204,4,204,5],[205,0,205,2],[205,3,205,5],[210,0,217,2],[210,3,217,5]]}
["Jab",null,null,"Strong",null,null,"Fierce"]
["Vel",{"$f":"VLOOKUP(A1,Manobras!$A:$K,3,0)","v":4},null,"Vel",{"$f":"VLOOKUP(D1,Manobras!$A:$K,3,0)","v":2},null,"Vel",{"$f":"VLOOKUP(G1,Manobras!$A:$K,3,0)","v":1}]
["Dano ",null,null,"Dano ",null,null,"Dano "]
[{"$f":"VLOOKUP(A1,Manobras!A:K,4,0)","v":3},null,null,{"$f":"VLOOKUP(D1,Manobras!$A:$K,4,0)","v":5},null,null,{"$f":"VLOOKUP(G1,Manobras!$A:$K,4,0)","v":7}]
["Mov",{"$f":"VLOOKUP(A1,Manobras!A:K,8,0)","v":4},null,"Mov",{"$f":"VLOOKUP(D1,Manobras!$A:$K,8,0)","v":4},null,"Mov",{"$f":"VLOOKUP(G1,Manobras!$A:$K,8,0)","v":3}]
["Custo","Chi",{"$f":"VLOOKUP(A1,Manobras!A:K,9,0)","v":0},"Custo","Chi",{"$f":"VLOOKUP(D1,Manobras!$A:$K,9,0)","v":0},"Custo","Chi",{"$f":"VLOOKUP(G1,Manobras!$A:$K,9,0)","v":0}]
{"$rows_left_out":215}
{"sheet":"Manobras Final","index":4,"n_rows":445,"n_cols":62,"rows_kept":445,"cut":false,"hidden":false,"merged":[]}
["Nome","Tecnica","Mod Vel","Mod Dano","Dano 2","Dano 3","Dano 4","Mod Mov","Chi","FdV","Sistema Resumido",null,null,null,null,null,null,null,null,null,null,null,null,null,null,null,null,null,null,null,null,null,null,null,null,null,null,null,null,null,null,null,null,null,null,null,null,null,null,null,null,null,null,null,null,null,null,null,null,null,null,"Manobras"]
[]
["MANOBRAS OFICIAIS"]
[]
["Acid Breath","Foco",{"$f":"-2+SUM('Ficha Final'!Q2)","v":0},{"$f":"3+SUM('Ficha Final'!S2,'Ficha Final'!K4)","v":4},{"$f":"0+SUM('Ficha Final'!S2,'Ficha Final'!K4)","v":1},{"$f":"-3+SUM('Ficha Final'!S2,'Ficha Final'!K4)","v":-2},null,{"$f":"-1+SUM('Ficha Final'!Q3)","v":-1},1,null,"Alcance = Vigor; alvo precisa estar na linha de visão; causa +3 DAN imediatamente; no fim do próximo, caso o ácido não seja removido, role agora com +0, e no fim de 2 turnos de espera com -3",null,null,null,null,null,null,null,null,null,null,null,null,null,null,null,null,null,null,null,null,null,null,null,null,null,null,null,null,null,null,null,null,null,null,null,null,null,null,null,null,null,null,null,null,null,null,null,null,null,null,"Acid Breath"]
["Air Blast","Foco",{"$f":"-1+SUM('Ficha Final'!Q2)","v":1},{"$f":"3+SUM('Ficha Final'!S2,'Ficha Final'!K4)","v":4},null,null,null,"Nenhum",1,null,"Alcance = Inteligência + Antecedente Elemental; alvo precisa estar na linha de visão; alvo precisa passar em um teste de Percepção + Luta às Cegas para perceber e interromper este ataque",null,null,null,null,null,null,null,null,null,null,null,null,null,null,null,null,null,null,null,null,null,null,null,null,null,null,null,null,null,null,null,null,null,null,null,null,null,null,null,null,null,null,null,null,null,null,null,null,null,null,"Air Blast"]
{"$rows_left_out":440}
{"sheet":"Ficha","index":5,"n_rows":46,"n_cols":19,"rows_kept":46,"cut":false,"hidden":false,"merged":[[22,6,23,6],[22,8,23,8],[22,3,23,3],[22,5,23,5],[7,9,7,10],[8,9,8,10],[9,9,9,10],[0,12,0,15],[5,9,5,10],[6,9,6,10],[13,9,13,10],[14,9,14,10],[15,9,15,10],[10,9,10,10],[11,9,11,10],[12,9,12,10],[19,9,19,10],[20,9,20,10],[21,9,21,10],[16,9,16,10],[17,9,17,10],[18,9,18,10],[25,9,25,10],[26,9,26,10],[27,9,27,10],[22,9,22,10],[23,9,23,10],[24,9,24,10],[31,9,31,10],[32,9,32,10],[33,9,33,10],[28,9,28,10],[29,9,29,10],[30,9,30,10],[37,9,37,10],[38,9,38,10],[39,9,39,10],[34,9,34,10],[35,9,35,10],[36,9,36,10],[43,9,43,10],[44,9,44,10],[45,9,45,10],[40,9,40,10],[41,9,41,10],[42,9,42,10]]}
[null,{"$f":"BASE!E36","v":" Kenichi Tanaka (Japan)"},null,null,{"$f":"D14","v":"Wu Shu "},null,null,null,null,"Chi: ","Vont: ","Saude: ",10,null,null,null,null,"Percepção",{"$f":"Ficha!H3","v":3}]
["ATRIBUTOS FÍSICOS (7/5/3)",null,null,"ATRIBUTOS SOCIAIS (7/5/3)",null,null,"ATRIBUTOS MENTAIS (7/5/3)",null,null,"Força",{"$f":"Ficha!B3","v":4},"Destreza",{"$f":"Ficha!B4","v":2},"Vigor",{"$f":"Ficha!B5","v":1},"Raciocinio",{"$f":"Ficha!H5","v":3},"Inteligencia",{"$f":"Ficha!H4","v":1}]
["FORÇA",{"$f":"1+BASE!D5","v":4},{"$f":"IF(B3=0,REPT(CHAR(109),5),REPT(CHAR(174),B3)&REPT(CHAR(109),5-B3))","v":"®®®®m"},"CARISMA",{"$f":"1+BASE!D9","v":4},{"$f":"IF(E3=0,REPT(CHAR(109),5),REPT(CHAR(174),E3)&REPT(CHAR(109),5-E3))","v":"®®®®m"},"PERCEPÇÃO",{"$f":"1+BASE!D13","v":3},{"$f":"IF(H3=0,REPT(CHAR(109),5),REPT(CHAR(174),H3)&REPT(CHAR(109),5-H3))","v":"®®®mm"},"Soco",{"$f":"Ficha!E15","v":0},"Chute",{"$f":"Ficha!E16","v":4},"Bloqueio",{"$f":"Ficha!E17","v":0},"Esportes",{"$f":"Ficha!E19","v":4},"Apresamento",{"$f":"Ficha!E18","v":0}]
["DESTREZA",{"$f":"1+BASE!D6","v":2},{"$f":"IF(B4=0,REPT(CHAR(109),5),REPT(CHAR(174),B4)&REPT(CHAR(109),5-B4))","v":"®®mmm"},"MANIPULAÇÃO",{"$f":"1+BASE!D10","v":1},{"$f":"IF(E4=0,REPT(CHAR(109),5),REPT(CHAR(174),E4)&REPT(CHAR(109),5-E4))","v":"®mmmm"},"INTELIGÊNCIA",{"$f":"1+BASE!D14","v":1},{"$f":"IF(H4=0,REPT(CHAR(109),5),REPT(CHAR(174),H4)&REPT(CHAR(109),5-H4))","v":"®mmmm"},"Foco",{"$f":"Ficha!E20","v":1},"Ciber/Hibrid",null,"Elemental",null,"Arma",null,"Arremesso"]
["VIGOR",{"$f":"1+BASE!D7","v":1},{"$f":"IF(B5=0,REPT(CHAR(109),5),REPT(CHAR(174),B5)&REPT(CHAR(109),5-B5))","v":"®mmmm"},"APARÊNCIA",{"$f":"1+BASE!D11","v":1},{"$f":"IF(E5=0,REPT(CHAR(109),5),REPT(CHAR(174),E5)&REPT(CHAR(109),5-E5))","v":"®mmmm"},"RACIOCÍNIO",{"$f":"1+BASE!D15","v":3},{"$f":"IF(H5=0,REPT(CHAR(109),5),REPT(CHAR(174),H5)&REPT(CHAR(109),5-H5))","v":"®®®mm"}]
["PERÍCIAS 1 (9/7/4)",null,null,"PERÍCIAS 2 (9/7/4)",null,null,"PERÍCIAS 3 (9/7/4)",null,null,"Manobras",null,"Vel","Dano","Dano 2","Dano 3","Dano 4","Mov","Chi","Vontade"]
{"$rows_left_out":41}
{"sheet":"Ficha Final","index":6,"n_rows":46,"n_cols":19,"rows_kept":46,"cut":false,"hidden":false,"merged":[[5,9,5,10],[6,9,6,10],[7,9,7,10],[0,12,0,15],[8,9,8,10],[9,9,9,10],[10,9,10,10],[11,9,11,10],[12,9,12,10],[13,9,13,10],[14,9,14,10],[15,9,15,10],[16,9,16,10],[17,9,17,10],[22,3,23,3],[22,5,23,5],[22,6,23,6],[22,8,23,8],[22,9,22,10],[23,9,23,10],[24,9,24,10],[25,9,25,10],[18,9,18,10],[19,9,19,10],[20,9,20,10],[21,9,21,10],[29,9,29,10],[30,9,30,10],[31,9,31,10],[26,9,26,10],[27,9,27,10],[28,9,28,10],[32,9,32,10],[33,9,33,10],[34,9,34,10],[35,9,35,10],[36,9,36,10],[43,9,43,10],[44,9,44,10],[45,9,45,10],[37,9,37,10],[38,9,38,10],[39,9,39,10],[40,9,40,10],[41,9,41,10],[42,9,42,10]]}
[null," David Johnson (England)",null,null,"Savate ",null,null,null,null,"Chi: ","Vont: ","Saude: ",10,null,null,null,null,"Percepção",{"$f":"'Ficha Final'!H3","v":2}]
["ATRIBUTOS FÍSICOS (7/5/3)",null,null,"ATRIBUTOS SOCIAIS (7/5/3)",null,null,"ATRIBUTOS MENTAIS (7/5/3)",null,null,"Força",{"$f":"'Ficha Final'!B3","v":5},"Destreza",{"$f":"'Ficha Final'!B4","v":1},"Vigor",{"$f":"'Ficha Final'!B5","v":2},"Raciocinio",{"$f":"'Ficha Final'!H5","v":2},"Inteligencia",{"$f":"'Ficha Final'!H4","v":1}]
["FORÇA",5,{"$f":"IF(B3=0,REPT(CHAR(109),5),REPT(CHAR(174),B3)&REPT(CHAR(109),5-B3))","v":"®®®®®"},"CARISMA",2,{"$f":"IF(E3=0,REPT(CHAR(109),5),REPT(CHAR(174),E3)&REPT(CHAR(109),5-E3))","v":"®®mmm"},"PERCEPÇÃO",2,{"$f":"IF(H3=0,REPT(CHAR(109),5),REPT(CHAR(174),H3)&REPT(CHAR(109),5-H3))","v":"®®mmm"},"Soco",{"$f":"'Ficha Final'!E15","v":4},"Chute",{"$f":"'Ficha Final'!E16","v":4},"Bloqueio",{"$f":"'Ficha Final'!E17","v":0},"Esportes",{"$f":"'Ficha Final'!E19","v":0},"Apresamento",{"$f":"'Ficha Final'!E18","v":0}]
["DESTREZA",1,{"$f":"IF(B4=0,REPT(CHAR(109),5),REPT(CHAR(174),B4)&REPT(CHAR(109),5-B4))","v":"®mmmm"},"MANIPULAÇÃO",2,{"$f":"IF(E4=0,REPT(CHAR(109),5),REPT(CHAR(174),E4)&REPT(CHAR(109),5-E4))","v":"®®mmm"},"INTELIGÊNCIA",1,{"$f":"IF(H4=0,REPT(CHAR(109),5),REPT(CHAR(174),H4)&REPT(CHAR(109),5-H4))","v":"®mmmm"},"Foco",{"$f":"'Ficha Final'!E20","v":0},"Ciber/Hibrid",null,"Elemental",null,"Arma",null,"Arremesso"]
["VIGOR",2,{"$f":"IF(B5=0,REPT(CHAR(109),5),REPT(CHAR(174),B5)&REPT(CHAR(109),5-B5))","v":"®®mmm"},"APARÊNCIA",4,{"$f":"IF(E5=0,REPT(CHAR(109),5),REPT(CHAR(174),E5)&REPT(CHAR(109),5-E5))","v":"®®®®m"},"RACIOCÍNIO",2,{"$f":"IF(H5=0,REPT(CHAR(109),5),REPT(CHAR(174),H5)&REPT(CHAR(109),5-H5))","v":"®®mmm"}]
["PERÍCIAS 1 (9/7/4)",null,null,"PERÍCIAS 2 (9/7/4)",null,null,"PERÍCIAS 3 (9/7/4)",null,null,"Manobras",null,"Vel","Dano","Dano 2","Dano 3","Dano 4","Mov","Chi","Vontade"]
{"$rows_left_out":41}
{"sheet":"Estilos","index":7,"n_rows":46,"n_cols":50,"rows_kept":46,"cut":false,"hidden":true,"merged":[]}
[null,"CHI","FV",null,null,"Aikidô ","Ansatsuken","Baraqah","Boxe ","Capoeira ","Forças Especiais ","Glimae ","Jeet Kune Dô ","Jiu Jitsu ","Jiu Jitsu Brasileiro ","Kabaddi ","Karatê Goju-ryu ","Karatê Hakyoku-Seiken ","Karatê Kanzuki-ryu ","Karatê Kyokugen Ryu ","Karatê Shin-Haqimken ","Karatê Shorin-Ryu ","Karatê Shotokan ","Kenpo ","Kickboxing Ocidental ","Kung Fu ","Kung fu Phei Hok Pai ","Kung Fu Taisan ","Ler Drit ","Lua ","Luta-Livre ","Luta-Livre Nativo American (NA)","Majestic Crow Kung Fu ","Macun-Lele ","Místico ","Muay Thai ","Ninjitsu ","O Kris ","O Pankration/ Wrestling ","O Trek ","Sanbo ","Savate ","Silat ","Soul Power ","Stroheim ","Sumo ","Tai Kwon Dô ","Tai Chi Chuan ","Thai Kick Boxing ","Wu Shu "]
["Aikidô ",5,2,null,"CHI",5,4,4,1,2,1,4,1,3,1,5,2,4,2,3,5,2,3,3,2,4,3,3,5,3,1,3,3,2,6,2,5,4,1,2,1,2,4,5,2,2,3,6,2,3]
["Ansatsuken",4,3,null,"FV",2,3,3,6,5,6,3,6,4,6,2,5,3,5,4,2,5,4,4,5,3,4,4,2,4,6,4,4,5,1,5,2,3,6,5,6,5,3,2,5,5,4,1,5,4]
["Baraqah",4,3,null,"SOCO",1,2,1,1,2,2,5,2,2,4,2,1,1,1,1,2,1,1,1,1,2,2,1,1,2,3,2,2,3,4,1,1,3,1,1,2,1,3,2,3,1,4,2,1,4]
["Boxe ",1,6,null,"CHUTE",3,3,null,5,1,1,5,1,3,4,3,1,2,3,2,3,1,1,1,1,1,1,1,1,2,4,3,1,1,3,1,1,3,2,3,3,1,2,2,1,3,1,3,1,1]
["Capoeira ",2,5,null,"BLOQUEIO",2,3,null,4,5,4,5,3,2,4,3,3,3,3,5,4,3,2,2,3,3,4,3,4,3,5,5,4,4,2,3,4,3,4,4,4,4,3,2,4,3,3,2,4,4]
{"$rows_left_out":41}
{"sheet":"BASE","index":8,"n_rows":100,"n_cols":12,"rows_kept":100,"cut":false,"hidden":true,"merged":[]}
[7,{"$f":"RAND()","v":0.76283545690436227},"FÍSICOS",{"$f":"INDEX($A$1:$A$3,RANK(B1,$B$1:$B$3),1)","v":5},null,null,null,null,null,null,{"$f":"IF(AND($D$2>$D$1,$D$2>$D$3),9,IF(AND($D$1>$D$2,$D$1>$D$3),7,4))","v":4},{"$f":"SUM(K2:K7)","v":4}]
[5,{"$f":"RAND()","v":2.8654135750898591E-2},"SOCIAIS",{"$f":"INDEX($A$1:$A$3,RANK(B2,$B$1:$B$3),1)","v":3},null,"PRONTIDÃO","FÍSICO",null,"PRONTIDÃO",{"$f":"VLOOKUP(I2,F:G,2,0)","v":"FÍSICO"},{"$f":"IF(K1>=5,RANDBETWEEN(0,5),RANDBETWEEN(0,K1))","v":2}]
[3,{"$f":"RAND()","v":0.85641355024729704},"MENTAIS",{"$f":"INDEX($A$1:$A$3,RANK(B3,$B$1:$B$3),1)","v":7},null,"LUTA ÀS CEGAS","FÍSICO",null,"PERSPICÁCIA","MENTAL",{"$f":"IF(K1-K2>0,RANDBETWEEN(0,IF(K1-K2>5,5,K1-K2)),0)","v":1}]
[null,null,null,null,null,"FURTIVIDADE","FÍSICO",null,"INTERROGAÇÃO","SOCIAL",{"$f":"IF(K1-(K2+K3)>0,RANDBETWEEN(0,IF(K1-(K2+K3)>5,5,K1-(K2+K3))),0)","v":1}]
[null,null,"FORÇA",{"$f":"IF($D$1>=5,RANDBETWEEN(0,4),RANDBETWEEN(0,$D$1))","v":3},null,"SOBREVIVÊNCIA","FÍSICO",null,"INTIMIDAÇÃO","SOCIAL",{"$f":"IF(K1-(K2+K3+K4)>0,RANDBETWEEN(0,IF(K1-(K2+K3+K4)>5,5,K1-(K2+K3+K4))),0)","v":0}]
[null,null,"DESTREZA",{"$f":"IF(D1-D5>=5,RANDBETWEEN(0,4),RANDBETWEEN(0,D1-D5))","v":1},null,"PERSPICÁCIA","MENTAL",null,"MANHA","SOCIAL",{"$f":"IF(K1-(K2+K3+K4+K5)>0,RANDBETWEEN(0,IF(K1-(K2+K3+K4+K5)>5,5,K1-(K2+K3+K4+K5))),0)","v":0}]
{"$rows_left_out":95}
{"sheet":"BASE MANOBRAS","index":9,"n_rows":49,"n_cols":29,"rows_kept":49,"cut":false,"hidden":true,"merged":[[0,8,0,13],[0,1,0,6]]}
[null,"QTDE DE MANOBRAS",null,null,null,null,null,null,"PONTOS DE TÉCNICA",null,null,null,null,null,null,null,null,null,null,null,null,null,null,"vel","dano","mov","CHI","FV","descrição"]
[null,"SOCO","CHUTE","BLOQUEIO","APRESAMENTO","ESPORTES","FOCO",null,"SOCO","CHUTE","BLOQUEIO","APRESAMENTO","ESPORTES","FOCO",null,"MANOBRA 1","MANOBRA 2","MANOBRA 3","MANOBRA 4"]
["Aikidô ",1,0,1,1,0,1,"Aikidô ",3,0,0,2,0,3,"Aikidô ","Lung Punch","Pin","Criminal Upper",null,null,null,null,"Athletic Sweep",{"$f":"-(1)","v":-1},{"$f":"+(2)","v":2},"Um",null,"1","Manobra de Agachamento. O dano é rolado duas vezes, e é necessário causar no mínimo 1 de dano em cada rolagem para causar knockdown"]
["Ansatsuken",1,0,0,0,1,1,"Ansatsuken",4,0,0,0,1,4,"Ansatsuken","Power Uppercut","Jump","Fireball",null,null,null,null,"Back Breaker",{"$f":"-(1)","v":-1},{"$f":"+(3)","v":3},"Um",null,null,"Knockdown"]
["Baraqah",1,0,0,0,1,1,"Baraqah",4,0,0,0,1,4,"Baraqah","Spinning Back Fist","Jump","Psychokinetic Channeling",null,null,null,null,"Balance","Zero","Zero",{"$f":"+(1)","v":1},null,null,"+1 movimento para manobras aéreas"]
["Boxe ",1,0,0,1,1,0,"Boxe ",4,0,0,4,1,0,"Boxe ","Double-Hit Punch","Escape","Brain Cracker",null,null,null,null,"Bear Hug",{"$f":"-(1)","v":-1},{"$f":"+(3)","v":3},"Um",null,null,"Sustentado"]
{"$rows_left_out":43}